Entry Id,Entry Date,Submitted By,Case Type,Gender,Date of Birth,Age,Disease Category,I. Congenital Malformations of the Respiratory Tract,IV. Infections of the Respiratory Tract,IV. B. Lower Respiratory Tract,V. Pleural Diseases,V. A. Pleural Effusion,VI. Non-infectious Disorders of the Respiratory Tract,VI. C. Tumors of the Chest & Lungs,VII. Other Diseases with Prominent Respiratory Component,IX. Airways Disease,X. Others Diseases,ICD CODE,Diagnosis,Created By (User Id),Source Url,User Agent,User IP,Approval Status,Workflow Current Status Timestamp
4792,07/06/2021 11:56,chonghua.registry,New,Male,22/07/2020,0,II. Respiratory Disorders of the Newborn,,,,,,,,,,,P29.3,Persistent pulmonary hypertension of the newborn,216,https://papp.org.ph/registry-of-diseases/registry-dashboard/,Mozilla/5.0 (Windows NT 10.0; Win64; x64; rv:89.0) Gecko/20100101 Firefox/89.0,180.232.130.138,3,
4791,07/06/2021 11:55,chonghua.registry,New,Female,06/08/2020,0,II. Respiratory Disorders of the Newborn,,,,,,,,,,,P22.1,Transient Tachypnea of the Newborn,216,https://papp.org.ph/registry-of-diseases/registry-dashboard/,Mozilla/5.0 (Windows NT 10.0; Win64; x64; rv:89.0) Gecko/20100101 Firefox/89.0,180.232.130.138,3,
4790,30/05/2021 11:51,chonghua.registry,New,Female,04/11/2013,7,I. Congenital Malformations of the Respiratory Tract,A. Upper Airway,,,,,,,,,,J96,"Acute respiratory failure secondary to  brain contusion, open comminuted fracture, frontotemporal area secondary to MVA",216,https://papp.org.ph/registry-of-diseases/registry-dashboard/,Mozilla/5.0 (Windows NT 10.0; Win64; x64; rv:88.0) Gecko/20100101 Firefox/88.0,180.232.130.138,3,
4789,30/05/2021 11:48,chonghua.registry,New,Female,16/04/2021,0,X. Others Diseases,,,,,,,,,,D. Other diseases not specified,J96,"Acute respiratory failure secondary to ependymoma WHO grade 2 s/p suboccipital craniectomy, C1 Laminectomy, excision of tumor",216,https://papp.org.ph/registry-of-diseases/registry-dashboard/,Mozilla/5.0 (Windows NT 10.0; Win64; x64; rv:88.0) Gecko/20100101 Firefox/88.0,180.232.130.138,3,
4788,30/05/2021 11:46,chonghua.registry,New,Male,28/04/2021,0,VII. Other Diseases with Prominent Respiratory Component,,,,,,,,B. Pulmonary Hypertension,,,P29.30,Persistent pulmonary hypertension of the newborn,216,https://papp.org.ph/registry-of-diseases/registry-dashboard/,Mozilla/5.0 (Windows NT 10.0; Win64; x64; rv:88.0) Gecko/20100101 Firefox/88.0,180.232.130.138,3,
4787,30/05/2021 11:45,chonghua.registry,New,Female,30/04/2016,5,VI. Non-infectious Disorders of the Respiratory Tract,,,,,,A. Bronchial Asthma,,,,,J45.901,Bronchial asthma in severe acute exacerbation,216,https://papp.org.ph/registry-of-diseases/registry-dashboard/,Mozilla/5.0 (Windows NT 10.0; Win64; x64; rv:88.0) Gecko/20100101 Firefox/88.0,180.232.130.138,3,
4786,30/05/2021 11:45,chonghua.registry,Old,Male,20/03/2013,8,VI. Non-infectious Disorders of the Respiratory Tract,,,,,,A. Bronchial Asthma,,,,,J45.20,"Bronchial asthma, not in exacerbation, well controlled",216,https://papp.org.ph/registry-of-diseases/registry-dashboard/,Mozilla/5.0 (Windows NT 10.0; Win64; x64; rv:88.0) Gecko/20100101 Firefox/88.0,180.232.130.138,3,
4785,30/05/2021 11:44,chonghua.registry,New,Female,19/04/2016,5,VI. Non-infectious Disorders of the Respiratory Tract,,,,,,A. Bronchial Asthma,,,,,J45.901,Bronchial asthma in severe acute exacerbation,216,https://papp.org.ph/registry-of-diseases/registry-dashboard/,Mozilla/5.0 (Windows NT 10.0; Win64; x64; rv:88.0) Gecko/20100101 Firefox/88.0,180.232.130.138,3,
4784,30/05/2021 11:43,chonghua.registry,New,Female,21/07/2004,16,V. Pleural Diseases,,,,A. Pleural effusion,"1. Infectious-parapneumonic, effusion, TB effusion",,,,,,J90,"TB pleural effusion, bilatereal",216,https://papp.org.ph/registry-of-diseases/registry-dashboard/,Mozilla/5.0 (Windows NT 10.0; Win64; x64; rv:88.0) Gecko/20100101 Firefox/88.0,180.232.130.138,3,
4783,30/05/2021 11:41,chonghua.registry,Old,Male,27/08/2004,16,V. Pleural Diseases,,,,A. Pleural effusion,"1. Infectious-parapneumonic, effusion, TB effusion",,,,,,J90,Massive TB pleural effusion right,216,https://papp.org.ph/registry-of-diseases/registry-dashboard/,Mozilla/5.0 (Windows NT 10.0; Win64; x64; rv:88.0) Gecko/20100101 Firefox/88.0,180.232.130.138,3,
4782,30/05/2021 11:40,chonghua.registry,New,Male,02/03/2005,16,V. Pleural Diseases,,,,A. Pleural effusion,"1. Infectious-parapneumonic, effusion, TB effusion",,,,,,J90,"Parapneumonic effusion, bilateral",216,https://papp.org.ph/registry-of-diseases/registry-dashboard/,Mozilla/5.0 (Windows NT 10.0; Win64; x64; rv:88.0) Gecko/20100101 Firefox/88.0,180.232.130.138,3,
4781,30/05/2021 11:40,chonghua.registry,Old,Male,27/04/2002,19,IV. Infections of the Respiratory Tract,,B. Lower Respiratory Tract,"8 Pulmonary Tuberculosis (Exposure, Latent TB infection, TB Disease)",,,,,,,,A15,"Pulmonary TB, bacteriologically-confirmed",216,https://papp.org.ph/registry-of-diseases/registry-dashboard/,Mozilla/5.0 (Windows NT 10.0; Win64; x64; rv:88.0) Gecko/20100101 Firefox/88.0,180.232.130.138,3,
4780,30/05/2021 11:39,chonghua.registry,New,Male,11/09/2010,10,IV. Infections of the Respiratory Tract,,B. Lower Respiratory Tract,"8 Pulmonary Tuberculosis (Exposure, Latent TB infection, TB Disease)",,,,,,,,A15,"Pulmonary TB, clinically-diagnosed",216,https://papp.org.ph/registry-of-diseases/registry-dashboard/,Mozilla/5.0 (Windows NT 10.0; Win64; x64; rv:88.0) Gecko/20100101 Firefox/88.0,180.232.130.138,3,
4779,30/05/2021 11:38,chonghua.registry,New,Female,21/07/2004,16,IV. Infections of the Respiratory Tract,,B. Lower Respiratory Tract,"8 Pulmonary Tuberculosis (Exposure, Latent TB infection, TB Disease)",,,,,,,,A15,"Pulmonary TB, bacteriologically-confirmed",216,https://papp.org.ph/registry-of-diseases/registry-dashboard/,Mozilla/5.0 (Windows NT 10.0; Win64; x64; rv:88.0) Gecko/20100101 Firefox/88.0,180.232.130.138,3,
4778,30/05/2021 11:37,chonghua.registry,Old,Male,27/08/2004,16,IV. Infections of the Respiratory Tract,,B. Lower Respiratory Tract,"8 Pulmonary Tuberculosis (Exposure, Latent TB infection, TB Disease)",,,,,,,,A15,"Pulmonary TB, clinically-diagnosed",216,https://papp.org.ph/registry-of-diseases/registry-dashboard/,Mozilla/5.0 (Windows NT 10.0; Win64; x64; rv:88.0) Gecko/20100101 Firefox/88.0,180.232.130.138,3,
4777,30/05/2021 11:32,chonghua.registry,New,Male,24/02/2021,0,IV. Infections of the Respiratory Tract,,B. Lower Respiratory Tract,3. Ventilator Associated Pneumonia,,,,,,,,J95.851,Ventilator-associated pneumonia,216,https://papp.org.ph/registry-of-diseases/registry-dashboard/,Mozilla/5.0 (Windows NT 10.0; Win64; x64; rv:88.0) Gecko/20100101 Firefox/88.0,180.232.130.138,3,
4776,30/05/2021 11:31,chonghua.registry,New,Male,14/03/2021,0,IV. Infections of the Respiratory Tract,,B. Lower Respiratory Tract,2. Health Care Associated pneumonia,,,,,,,,J18.9,Hospital-acquired pneumonia,216,https://papp.org.ph/registry-of-diseases/registry-dashboard/,Mozilla/5.0 (Windows NT 10.0; Win64; x64; rv:88.0) Gecko/20100101 Firefox/88.0,180.232.130.138,3,
4775,30/05/2021 11:30,chonghua.registry,New,Female,16/10/2019,1,IV. Infections of the Respiratory Tract,,B. Lower Respiratory Tract,2. Health Care Associated pneumonia,,,,,,,,J18.9,Hospital-acquired pneumonia,216,https://papp.org.ph/registry-of-diseases/registry-dashboard/,Mozilla/5.0 (Windows NT 10.0; Win64; x64; rv:88.0) Gecko/20100101 Firefox/88.0,180.232.130.138,3,
4774,30/05/2021 11:30,chonghua.registry,New,Female,16/10/2019,1,IV. Infections of the Respiratory Tract,,B. Lower Respiratory Tract,2. Health Care Associated pneumonia,,,,,,,,J18.9,Hospital-acquired pneumonia,216,https://papp.org.ph/registry-of-diseases/registry-dashboard/,Mozilla/5.0 (Windows NT 10.0; Win64; x64; rv:88.0) Gecko/20100101 Firefox/88.0,180.232.130.138,3,
4773,30/05/2021 11:29,chonghua.registry,New,Male,04/03/2021,0,IV. Infections of the Respiratory Tract,,B. Lower Respiratory Tract,2. Health Care Associated pneumonia,,,,,,,,J18.9,Hospital-acquired pneumonia,216,https://papp.org.ph/registry-of-diseases/registry-dashboard/,Mozilla/5.0 (Windows NT 10.0; Win64; x64; rv:88.0) Gecko/20100101 Firefox/88.0,180.232.130.138,3,
4772,30/05/2021 11:28,chonghua.registry,Old,Male,22/09/2020,0,IV. Infections of the Respiratory Tract,,B. Lower Respiratory Tract,2. Health Care Associated pneumonia,,,,,,,,J18.9,Hospital-acquired pneumonia,216,https://papp.org.ph/registry-of-diseases/registry-dashboard/,Mozilla/5.0 (Windows NT 10.0; Win64; x64; rv:88.0) Gecko/20100101 Firefox/88.0,180.232.130.138,3,
4771,30/05/2021 11:27,chonghua.registry,New,Male,31/10/2015,5,IV. Infections of the Respiratory Tract,,B. Lower Respiratory Tract,2. Health Care Associated pneumonia,,,,,,,,J18.9,Hospital-acquired pneumonia,216,https://papp.org.ph/registry-of-diseases/registry-dashboard/,Mozilla/5.0 (Windows NT 10.0; Win64; x64; rv:88.0) Gecko/20100101 Firefox/88.0,180.232.130.138,3,
4770,30/05/2021 11:26,chonghua.registry,New,Male,24/02/2021,0,IV. Infections of the Respiratory Tract,,B. Lower Respiratory Tract,2. Health Care Associated pneumonia,,,,,,,,J18.9,Hospital-acquired pneumonia,216,https://papp.org.ph/registry-of-diseases/registry-dashboard/,Mozilla/5.0 (Windows NT 10.0; Win64; x64; rv:88.0) Gecko/20100101 Firefox/88.0,180.232.130.138,3,
4769,30/05/2021 11:26,chonghua.registry,New,Female,30/04/2016,5,IV. Infections of the Respiratory Tract,,B. Lower Respiratory Tract,"1. Pneumonia, community acquired- (PCAP A, B, C or D)",,,,,,,,J18.9,Pediatric Community Acquired Pneumonia C,216,https://papp.org.ph/registry-of-diseases/registry-dashboard/,Mozilla/5.0 (Windows NT 10.0; Win64; x64; rv:88.0) Gecko/20100101 Firefox/88.0,180.232.130.138,3,
4768,30/05/2021 11:25,chonghua.registry,New,Female,19/04/2016,5,IV. Infections of the Respiratory Tract,,B. Lower Respiratory Tract,"1. Pneumonia, community acquired- (PCAP A, B, C or D)",,,,,,,,J18.9,Pediatric Community Acquired Pneumonia C,216,https://papp.org.ph/registry-of-diseases/registry-dashboard/,Mozilla/5.0 (Windows NT 10.0; Win64; x64; rv:88.0) Gecko/20100101 Firefox/88.0,180.232.130.138,3,
4767,30/05/2021 11:24,chonghua.registry,New,Female,05/08/2019,1,IV. Infections of the Respiratory Tract,,A. Upper Respiratory Tract,,,,,,,,,J03.90,"Acute tonsillopharyngitis, non-exudative, bilateral grade 2",216,https://papp.org.ph/registry-of-diseases/registry-dashboard/,Mozilla/5.0 (Windows NT 10.0; Win64; x64; rv:88.0) Gecko/20100101 Firefox/88.0,180.232.130.138,3,
4766,30/05/2021 11:23,chonghua.registry,New,Female,11/04/2014,7,IV. Infections of the Respiratory Tract,,A. Upper Respiratory Tract,,,,,,,,,J03.90,"Acute tonsillopharyngitis, non-exudative, right, grade 2",216,https://papp.org.ph/registry-of-diseases/registry-dashboard/,Mozilla/5.0 (Windows NT 10.0; Win64; x64; rv:88.0) Gecko/20100101 Firefox/88.0,180.232.130.138,3,
4765,30/05/2021 11:23,chonghua.registry,New,Female,20/01/2014,7,IV. Infections of the Respiratory Tract,,A. Upper Respiratory Tract,,,,,,,,,J03.90,"Acute tonsillopharyngitis, non-exudative, right, grade 3",216,https://papp.org.ph/registry-of-diseases/registry-dashboard/,Mozilla/5.0 (Windows NT 10.0; Win64; x64; rv:88.0) Gecko/20100101 Firefox/88.0,180.232.130.138,3,
4764,30/05/2021 11:22,chonghua.registry,New,Female,21/04/2020,1,IV. Infections of the Respiratory Tract,,A. Upper Respiratory Tract,,,,,,,,,J00,Acute nasopharyngitis,216,https://papp.org.ph/registry-of-diseases/registry-dashboard/,Mozilla/5.0 (Windows NT 10.0; Win64; x64; rv:88.0) Gecko/20100101 Firefox/88.0,180.232.130.138,3,
4763,30/05/2021 11:21,chonghua.registry,New,Male,28/04/2021,0,II. Respiratory Disorders of the Newborn,,,,,,,,,,,P24.01,Meconium aspiration syndrome,216,https://papp.org.ph/registry-of-diseases/registry-dashboard/,Mozilla/5.0 (Windows NT 10.0; Win64; x64; rv:88.0) Gecko/20100101 Firefox/88.0,180.232.130.138,3,
4762,30/05/2021 11:20,chonghua.registry,New,Male,12/04/2021,0,II. Respiratory Disorders of the Newborn,,,,,,,,,,,P23.9,Neonatal pneumonia,216,https://papp.org.ph/registry-of-diseases/registry-dashboard/,Mozilla/5.0 (Windows NT 10.0; Win64; x64; rv:88.0) Gecko/20100101 Firefox/88.0,180.232.130.138,3,
