Entry Id,Entry Date,Submitted By,Case Type,Gender,Date of Birth,Age,Disease Category,I. Congenital Malformations of the Respiratory Tract,IV. Infections of the Respiratory Tract,IV. B. Lower Respiratory Tract,V. Pleural Diseases,V. A. Pleural Effusion,VI. Non-infectious Disorders of the Respiratory Tract,VI. C. Tumors of the Chest & Lungs,VII. Other Diseases with Prominent Respiratory Component,IX. Airways Disease,X. Others Diseases,ICD CODE,Diagnosis,Created By (User Id),Source Url,User Agent,User IP,Approval Status,Workflow Current Status Timestamp
4744,29/05/2021 9:41,chonghua.registry,New,Male,02/04/2016,5,VII. Other Diseases with Prominent Respiratory Component,,,,,,,,A.Pumonary Congestion/Edema,,,E87.71,Transfusion-associated circulatory overload,216,https://papp.org.ph/registry-of-diseases/registry-dashboard/,Mozilla/5.0 (Windows NT 10.0; Win64; x64; rv:88.0) Gecko/20100101 Firefox/88.0,180.232.130.138,3,
4743,29/05/2021 9:40,chonghua.registry,Old,Male,13/08/2018,2,VI. Non-infectious Disorders of the Respiratory Tract,,,,,,A. Bronchial Asthma,,,,,J45,Bronchial asthma in severe acute exacerbation,216,https://papp.org.ph/registry-of-diseases/registry-dashboard/,Mozilla/5.0 (Windows NT 10.0; Win64; x64; rv:88.0) Gecko/20100101 Firefox/88.0,180.232.130.138,3,
4742,29/05/2021 9:39,chonghua.registry,New,Male,25/10/2019,1,IV. Infections of the Respiratory Tract,,B. Lower Respiratory Tract,"1. Pneumonia, community acquired- (PCAP A, B, C or D)",,,,,,,,J18.9,Pediatric community acquired pneumonia A/B,216,https://papp.org.ph/registry-of-diseases/registry-dashboard/,Mozilla/5.0 (Windows NT 10.0; Win64; x64; rv:88.0) Gecko/20100101 Firefox/88.0,180.232.130.138,3,
4741,29/05/2021 9:38,chonghua.registry,New,Female,07/01/2018,3,IV. Infections of the Respiratory Tract,,B. Lower Respiratory Tract,"1. Pneumonia, community acquired- (PCAP A, B, C or D)",,,,,,,,J18.9,Pediatric community acquired pneumonia C,216,https://papp.org.ph/registry-of-diseases/registry-dashboard/,Mozilla/5.0 (Windows NT 10.0; Win64; x64; rv:88.0) Gecko/20100101 Firefox/88.0,180.232.130.138,3,
4740,29/05/2021 9:37,chonghua.registry,New,Male,04/10/2019,1,IV. Infections of the Respiratory Tract,,B. Lower Respiratory Tract,"1. Pneumonia, community acquired- (PCAP A, B, C or D)",,,,,,,,J18.9,Pediatric community acquired pneumonia A/B,216,https://papp.org.ph/registry-of-diseases/registry-dashboard/,Mozilla/5.0 (Windows NT 10.0; Win64; x64; rv:88.0) Gecko/20100101 Firefox/88.0,180.232.130.138,3,
4739,29/05/2021 9:36,chonghua.registry,New,Male,19/10/2020,0,IV. Infections of the Respiratory Tract,,B. Lower Respiratory Tract,"1. Pneumonia, community acquired- (PCAP A, B, C or D)",,,,,,,,J18.9,Pediatric community acquired pneumonia A/B,216,https://papp.org.ph/registry-of-diseases/registry-dashboard/,Mozilla/5.0 (Windows NT 10.0; Win64; x64; rv:88.0) Gecko/20100101 Firefox/88.0,180.232.130.138,3,
4738,29/05/2021 9:35,chonghua.registry,New,Male,05/05/2020,1,IV. Infections of the Respiratory Tract,,B. Lower Respiratory Tract,"1. Pneumonia, community acquired- (PCAP A, B, C or D)",,,,,,,,J18.9,Pediatric community acquired pneumonia D,216,https://papp.org.ph/registry-of-diseases/registry-dashboard/,Mozilla/5.0 (Windows NT 10.0; Win64; x64; rv:88.0) Gecko/20100101 Firefox/88.0,180.232.130.138,3,
4737,29/05/2021 9:34,chonghua.registry,New,Male,27/08/2016,4,IV. Infections of the Respiratory Tract,,B. Lower Respiratory Tract,"1. Pneumonia, community acquired- (PCAP A, B, C or D)",,,,,,,,J18.9,Pediatric community acquired pneumonia C,216,https://papp.org.ph/registry-of-diseases/registry-dashboard/,Mozilla/5.0 (Windows NT 10.0; Win64; x64; rv:88.0) Gecko/20100101 Firefox/88.0,180.232.130.138,3,
4736,29/05/2021 9:33,chonghua.registry,New,Male,23/06/2010,10,IV. Infections of the Respiratory Tract,,B. Lower Respiratory Tract,"1. Pneumonia, community acquired- (PCAP A, B, C or D)",,,,,,,,J18.9,Pediatric community acquired pneumonia A/B,216,https://papp.org.ph/registry-of-diseases/registry-dashboard/,Mozilla/5.0 (Windows NT 10.0; Win64; x64; rv:88.0) Gecko/20100101 Firefox/88.0,180.232.130.138,3,
4735,29/05/2021 9:33,chonghua.registry,New,Male,25/08/2018,2,IV. Infections of the Respiratory Tract,,A. Upper Respiratory Tract,,,,,,,,,J02.9,Acute nasopharyngitis,216,https://papp.org.ph/registry-of-diseases/registry-dashboard/,Mozilla/5.0 (Windows NT 10.0; Win64; x64; rv:88.0) Gecko/20100101 Firefox/88.0,180.232.130.138,3,
4734,29/05/2021 9:32,chonghua.registry,New,Female,09/03/2021,0,II. Respiratory Disorders of the Newborn,,,,,,,,,,,P22.0,Respiratory distress of the newborn,216,https://papp.org.ph/registry-of-diseases/registry-dashboard/,Mozilla/5.0 (Windows NT 10.0; Win64; x64; rv:88.0) Gecko/20100101 Firefox/88.0,180.232.130.138,3,
4733,29/05/2021 9:31,chonghua.registry,New,Female,01/03/2021,0,II. Respiratory Disorders of the Newborn,,,,,,,,,,,P23.9,Neonatal pneumonia,216,https://papp.org.ph/registry-of-diseases/registry-dashboard/,Mozilla/5.0 (Windows NT 10.0; Win64; x64; rv:88.0) Gecko/20100101 Firefox/88.0,180.232.130.138,3,
4732,29/05/2021 9:28,chonghua.registry,New,Female,25/08/2020,0,IV. Infections of the Respiratory Tract,,B. Lower Respiratory Tract,"1. Pneumonia, community acquired- (PCAP A, B, C or D)",,,,,,,,J18.9,Pediatric Community Acquired Pneumonia C,216,https://papp.org.ph/registry-of-diseases/registry-dashboard/,Mozilla/5.0 (Windows NT 10.0; Win64; x64; rv:88.0) Gecko/20100101 Firefox/88.0,180.232.130.138,3,
4731,29/05/2021 9:28,chonghua.registry,New,Male,06/06/2019,1,IV. Infections of the Respiratory Tract,,B. Lower Respiratory Tract,"1. Pneumonia, community acquired- (PCAP A, B, C or D)",,,,,,,,J18.9,Pediatric Community Acquired Pneumonia C,216,https://papp.org.ph/registry-of-diseases/registry-dashboard/,Mozilla/5.0 (Windows NT 10.0; Win64; x64; rv:88.0) Gecko/20100101 Firefox/88.0,180.232.130.138,3,
