Entry Id,Entry Date,Submitted By,Case Type,Gender,Date of Birth,Age,Disease Category,I. Congenital Malformations of the Respiratory Tract,IV. Infections of the Respiratory Tract,IV. B. Lower Respiratory Tract,V. Pleural Diseases,V. A. Pleural Effusion,VI. Non-infectious Disorders of the Respiratory Tract,VI. C. Tumors of the Chest & Lungs,VII. Other Diseases with Prominent Respiratory Component,IX. Airways Disease,X. Others Diseases,ICD CODE,Diagnosis,Created By (User Id),Source Url,User Agent,User IP,Approval Status,Workflow Current Status Timestamp
4677,29/05/2021 8:23,chonghua.registry,New,Female,25/03/2020,1,IV. Infections of the Respiratory Tract,,B. Lower Respiratory Tract,"1. Pneumonia, community acquired- (PCAP A, B, C or D)",,,,,,,,J18.9,Pediatric Community Acquired Pneumonia A/B,216,https://papp.org.ph/registry-of-diseases/registry-dashboard/,Mozilla/5.0 (Windows NT 10.0; Win64; x64; rv:88.0) Gecko/20100101 Firefox/88.0,180.232.130.138,3,
4676,29/05/2021 8:22,chonghua.registry,New,Female,29/10/2011,9,IV. Infections of the Respiratory Tract,,A. Upper Respiratory Tract,,,,,,,,,J03.90,"Acute tonsillopharyngitis, non-exudative, bilateral grade 3",216,https://papp.org.ph/registry-of-diseases/registry-dashboard/,Mozilla/5.0 (Windows NT 10.0; Win64; x64; rv:88.0) Gecko/20100101 Firefox/88.0,180.232.130.138,3,
4675,29/05/2021 8:22,chonghua.registry,New,Female,30/04/2006,15,IV. Infections of the Respiratory Tract,,A. Upper Respiratory Tract,,,,,,,,,J03.90,"Acute tonsillopharyngitis, non-exudative, right, grade 2",216,https://papp.org.ph/registry-of-diseases/registry-dashboard/,Mozilla/5.0 (Windows NT 10.0; Win64; x64; rv:88.0) Gecko/20100101 Firefox/88.0,180.232.130.138,3,
4674,29/05/2021 8:21,chonghua.registry,New,Female,24/06/2019,1,IV. Infections of the Respiratory Tract,,A. Upper Respiratory Tract,,,,,,,,,J03.90,"Acute tonsillopharyngitis, exudatve, bilateral grade 3",216,https://papp.org.ph/registry-of-diseases/registry-dashboard/,Mozilla/5.0 (Windows NT 10.0; Win64; x64; rv:88.0) Gecko/20100101 Firefox/88.0,180.232.130.138,3,
4673,29/05/2021 8:20,chonghua.registry,New,Male,15/12/2018,2,IV. Infections of the Respiratory Tract,,A. Upper Respiratory Tract,,,,,,,,,J00,Acute nasopharyngitis,216,https://papp.org.ph/registry-of-diseases/registry-dashboard/,Mozilla/5.0 (Windows NT 10.0; Win64; x64; rv:88.0) Gecko/20100101 Firefox/88.0,180.232.130.138,3,
4672,29/05/2021 8:19,chonghua.registry,New,Female,13/10/2020,0,IV. Infections of the Respiratory Tract,,A. Upper Respiratory Tract,,,,,,,,,J00,Acute nasopharyngitis,216,https://papp.org.ph/registry-of-diseases/registry-dashboard/,Mozilla/5.0 (Windows NT 10.0; Win64; x64; rv:88.0) Gecko/20100101 Firefox/88.0,180.232.130.138,3,
4671,29/05/2021 8:18,chonghua.registry,New,Female,22/09/2002,18,VIII. Disorders of the Respiratory Tract due to Trauma,,,,,,,,,,,J05.10,Acute epiglotitis secondary to caustic ingestion,216,https://papp.org.ph/registry-of-diseases/registry-dashboard/,Mozilla/5.0 (Windows NT 10.0; Win64; x64; rv:88.0) Gecko/20100101 Firefox/88.0,180.232.130.138,3,
4670,29/05/2021 8:17,chonghua.registry,New,Male,08/07/2016,4,IV. Infections of the Respiratory Tract,,A. Upper Respiratory Tract,,,,,,,,,J00,Acute nasopharyngitis,216,https://papp.org.ph/registry-of-diseases/registry-dashboard/,Mozilla/5.0 (Windows NT 10.0; Win64; x64; rv:88.0) Gecko/20100101 Firefox/88.0,180.232.130.138,3,
4669,29/05/2021 8:16,chonghua.registry,New,Female,18/12/2020,0,II. Respiratory Disorders of the Newborn,,,,,,,,,,,P23.9,Neonatal Pneumonia,216,https://papp.org.ph/registry-of-diseases/registry-dashboard/,Mozilla/5.0 (Windows NT 10.0; Win64; x64; rv:88.0) Gecko/20100101 Firefox/88.0,180.232.130.138,3,
4668,29/05/2021 8:15,chonghua.registry,New,Male,01/12/2020,0,II. Respiratory Disorders of the Newborn,,,,,,,,,,,P23.9,Neonatal Pneumonia,216,https://papp.org.ph/registry-of-diseases/registry-dashboard/,Mozilla/5.0 (Windows NT 10.0; Win64; x64; rv:88.0) Gecko/20100101 Firefox/88.0,180.232.130.138,3,
4667,29/05/2021 8:13,chonghua.registry,New,Male,01/12/2020,0,II. Respiratory Disorders of the Newborn,,,,,,,,,,,P23.9,Neonatal Pneumonia,216,https://papp.org.ph/registry-of-diseases/registry-dashboard/,Mozilla/5.0 (Windows NT 10.0; Win64; x64; rv:88.0) Gecko/20100101 Firefox/88.0,180.232.130.138,3,
4666,29/05/2021 8:12,chonghua.registry,New,Female,05/08/2020,0,I. Congenital Malformations of the Respiratory Tract,A. Upper Airway,,,,,,,,,,D18.09,Subglottic hemangioma,216,https://papp.org.ph/registry-of-diseases/registry-dashboard/,Mozilla/5.0 (Windows NT 10.0; Win64; x64; rv:88.0) Gecko/20100101 Firefox/88.0,180.232.130.138,3,
4665,29/05/2021 8:10,chonghua.registry,New,Female,07/07/2017,3,IV. Infections of the Respiratory Tract,,B. Lower Respiratory Tract,"1. Pneumonia, community acquired- (PCAP A, B, C or D)",,,,,,,,J18.9,Pediatric Community Acquired Pneumonia A/B,216,https://papp.org.ph/registry-of-diseases/registry-dashboard/,Mozilla/5.0 (Windows NT 10.0; Win64; x64; rv:88.0) Gecko/20100101 Firefox/88.0,180.232.130.138,3,
4664,29/05/2021 8:09,chonghua.registry,New,Male,09/03/2019,2,IV. Infections of the Respiratory Tract,,B. Lower Respiratory Tract,"1. Pneumonia, community acquired- (PCAP A, B, C or D)",,,,,,,,J18.9,Pediatric Community Acquired Pneumonia A/B,216,https://papp.org.ph/registry-of-diseases/registry-dashboard/,Mozilla/5.0 (Windows NT 10.0; Win64; x64; rv:88.0) Gecko/20100101 Firefox/88.0,180.232.130.138,3,
4663,29/05/2021 8:09,chonghua.registry,New,Male,05/05/2019,2,IV. Infections of the Respiratory Tract,,B. Lower Respiratory Tract,"1. Pneumonia, community acquired- (PCAP A, B, C or D)",,,,,,,,J18.9,Pediatric Community Acquired Pneumonia C,216,https://papp.org.ph/registry-of-diseases/registry-dashboard/,Mozilla/5.0 (Windows NT 10.0; Win64; x64; rv:88.0) Gecko/20100101 Firefox/88.0,180.232.130.138,3,
4662,29/05/2021 8:08,chonghua.registry,New,Male,29/05/2019,2,IV. Infections of the Respiratory Tract,,B. Lower Respiratory Tract,"1. Pneumonia, community acquired- (PCAP A, B, C or D)",,,,,,,,J18.9,Pediatric Community Acquired Pneumonia C,216,https://papp.org.ph/registry-of-diseases/registry-dashboard/,Mozilla/5.0 (Windows NT 10.0; Win64; x64; rv:88.0) Gecko/20100101 Firefox/88.0,180.232.130.138,3,
4661,29/05/2021 8:07,chonghua.registry,New,Male,19/12/2019,1,IV. Infections of the Respiratory Tract,,B. Lower Respiratory Tract,"1. Pneumonia, community acquired- (PCAP A, B, C or D)",,,,,,,,J18.9,Pediatric Community Acquired Pneumonia C,216,https://papp.org.ph/registry-of-diseases/registry-dashboard/,Mozilla/5.0 (Windows NT 10.0; Win64; x64; rv:88.0) Gecko/20100101 Firefox/88.0,180.232.130.138,3,
4660,29/05/2021 8:06,chonghua.registry,New,Male,13/08/2018,2,IV. Infections of the Respiratory Tract,,B. Lower Respiratory Tract,"1. Pneumonia, community acquired- (PCAP A, B, C or D)",,,,,,,,J18.9,Pediatric Community Acquired Pneumonia C,216,https://papp.org.ph/registry-of-diseases/registry-dashboard/,Mozilla/5.0 (Windows NT 10.0; Win64; x64; rv:88.0) Gecko/20100101 Firefox/88.0,180.232.130.138,3,
4659,29/05/2021 8:05,chonghua.registry,New,Female,16/03/2004,17,IV. Infections of the Respiratory Tract,,B. Lower Respiratory Tract,"1. Pneumonia, community acquired- (PCAP A, B, C or D)",,,,,,,,J18.9,Pediatric Community Acquired Pneumonia A/B,216,https://papp.org.ph/registry-of-diseases/registry-dashboard/,Mozilla/5.0 (Windows NT 10.0; Win64; x64; rv:88.0) Gecko/20100101 Firefox/88.0,180.232.130.138,3,
4658,29/05/2021 8:04,chonghua.registry,New,Male,07/11/2010,10,IV. Infections of the Respiratory Tract,,B. Lower Respiratory Tract,"1. Pneumonia, community acquired- (PCAP A, B, C or D)",,,,,,,,J18.9,Pediatric Community Acquired Pneumonia A/B,216,https://papp.org.ph/registry-of-diseases/registry-dashboard/,Mozilla/5.0 (Windows NT 10.0; Win64; x64; rv:88.0) Gecko/20100101 Firefox/88.0,180.232.130.138,3,
