Entry Id,Entry Date,Submitted By,Case Type,Gender,Date of Birth,Age,Disease Category,I. Congenital Malformations of the Respiratory Tract,IV. Infections of the Respiratory Tract,IV. B. Lower Respiratory Tract,V. Pleural Diseases,V. A. Pleural Effusion,VI. Non-infectious Disorders of the Respiratory Tract,VI. C. Tumors of the Chest & Lungs,VII. Other Diseases with Prominent Respiratory Component,IX. Airways Disease,X. Others Diseases,ICD CODE,Diagnosis,Created By (User Id),Source Url,User Agent,User IP,Approval Status,Workflow Current Status Timestamp
4657,29/05/2021 8:03,chonghua.registry,New,Male,13/01/2019,2,IV. Infections of the Respiratory Tract,,B. Lower Respiratory Tract,"1. Pneumonia, community acquired- (PCAP A, B, C or D)",,,,,,,,J18.9,Pediatric Community Acquired Pneumonia C,216,https://papp.org.ph/registry-of-diseases/registry-dashboard/,Mozilla/5.0 (Windows NT 10.0; Win64; x64; rv:88.0) Gecko/20100101 Firefox/88.0,180.232.130.138,3,
4656,29/05/2021 8:02,chonghua.registry,New,Male,15/11/2011,9,IV. Infections of the Respiratory Tract,,B. Lower Respiratory Tract,"1. Pneumonia, community acquired- (PCAP A, B, C or D)",,,,,,,,J18.9,Pediatric Community Acquired Pneumonia C,216,https://papp.org.ph/registry-of-diseases/registry-dashboard/,Mozilla/5.0 (Windows NT 10.0; Win64; x64; rv:88.0) Gecko/20100101 Firefox/88.0,180.232.130.138,3,
4655,29/05/2021 8:02,chonghua.registry,New,Male,29/06/2017,3,IV. Infections of the Respiratory Tract,,A. Upper Respiratory Tract,,,,,,,,,J03.9,"Acute tonsilopharyngitis, grade II, exudative, right",216,https://papp.org.ph/registry-of-diseases/registry-dashboard/,Mozilla/5.0 (Windows NT 10.0; Win64; x64; rv:88.0) Gecko/20100101 Firefox/88.0,180.232.130.138,3,
4654,29/05/2021 8:01,chonghua.registry,New,Female,17/11/2017,3,I. Congenital Malformations of the Respiratory Tract,A. Upper Airway,,,,,,,,,,J02.9,Acute nasopharyngitis,216,https://papp.org.ph/registry-of-diseases/registry-dashboard/,Mozilla/5.0 (Windows NT 10.0; Win64; x64; rv:88.0) Gecko/20100101 Firefox/88.0,180.232.130.138,3,
4653,29/05/2021 8:00,chonghua.registry,New,Female,10/11/2011,9,IV. Infections of the Respiratory Tract,,B. Lower Respiratory Tract,6. Acute bronchitis/bronchiolitis,,,,,,,,J20.9,Acute bronchitis,216,https://papp.org.ph/registry-of-diseases/registry-dashboard/,Mozilla/5.0 (Windows NT 10.0; Win64; x64; rv:88.0) Gecko/20100101 Firefox/88.0,180.232.130.138,3,
4652,29/05/2021 7:58,chonghua.registry,New,Male,05/09/2020,0,IV. Infections of the Respiratory Tract,,A. Upper Respiratory Tract,,,,,,,,,J39.0,Retropharyngeal abscess (abscess culture growth: MSSA & Stenotrophomonas maltophila),216,https://papp.org.ph/registry-of-diseases/registry-dashboard/,Mozilla/5.0 (Windows NT 10.0; Win64; x64; rv:88.0) Gecko/20100101 Firefox/88.0,180.232.130.138,3,
4651,29/05/2021 7:57,chonghua.registry,Old,Male,29/05/2020,0,III. Bronchopulmonary Dysplasia,,,,,,,,,,,P27.1,"Bronchopulmonary dysplasia, moderate",216,https://papp.org.ph/registry-of-diseases/registry-dashboard/,Mozilla/5.0 (Windows NT 10.0; Win64; x64; rv:88.0) Gecko/20100101 Firefox/88.0,180.232.130.138,3,
4650,29/05/2021 7:56,chonghua.registry,New,Female,21/11/2020,0,II. Respiratory Disorders of the Newborn,,,,,,,,,,,P23.9,Neonatal pneumonia,216,https://papp.org.ph/registry-of-diseases/registry-dashboard/,Mozilla/5.0 (Windows NT 10.0; Win64; x64; rv:88.0) Gecko/20100101 Firefox/88.0,180.232.130.138,3,
4649,29/05/2021 7:55,chonghua.registry,New,Female,14/11/2020,0,II. Respiratory Disorders of the Newborn,,,,,,,,,,,P23.9,Neonatal pneumonia (twin 2),216,https://papp.org.ph/registry-of-diseases/registry-dashboard/,Mozilla/5.0 (Windows NT 10.0; Win64; x64; rv:88.0) Gecko/20100101 Firefox/88.0,180.232.130.138,3,
4648,29/05/2021 7:54,chonghua.registry,New,Female,14/11/2021,0,II. Respiratory Disorders of the Newborn,,,,,,,,,,,P23.9,Neonatal pneumonia (twin 1),216,https://papp.org.ph/registry-of-diseases/registry-dashboard/,Mozilla/5.0 (Windows NT 10.0; Win64; x64; rv:88.0) Gecko/20100101 Firefox/88.0,180.232.130.138,3,
4647,29/05/2021 7:53,chonghua.registry,New,Male,14/11/2021,0,II. Respiratory Disorders of the Newborn,,,,,,,,,,,P22.0,Respiratory distress syndrome,216,https://papp.org.ph/registry-of-diseases/registry-dashboard/,Mozilla/5.0 (Windows NT 10.0; Win64; x64; rv:88.0) Gecko/20100101 Firefox/88.0,180.232.130.138,3,
4646,29/05/2021 7:52,chonghua.registry,New,Male,11/01/2021,0,II. Respiratory Disorders of the Newborn,,,,,,,,,,,P23.9,Neonatal pneumonia,216,https://papp.org.ph/registry-of-diseases/registry-dashboard/,Mozilla/5.0 (Windows NT 10.0; Win64; x64; rv:88.0) Gecko/20100101 Firefox/88.0,180.232.130.138,3,
4645,29/05/2021 7:49,chonghua.registry,New,Female,16/12/2007,13,X. Others Diseases,,,,,,,,,,C. Scoliosis,M41.1,"adolescent idiopathic scoliosis, severe",216,https://papp.org.ph/registry-of-diseases/registry-dashboard/,Mozilla/5.0 (Windows NT 10.0; Win64; x64; rv:88.0) Gecko/20100101 Firefox/88.0,180.232.130.138,3,
