Entry Id,Entry Date,Submitted By,Case Type,Gender,Date of Birth,Age,Disease Category,I. Congenital Malformations of the Respiratory Tract,IV. Infections of the Respiratory Tract,IV. B. Lower Respiratory Tract,V. Pleural Diseases,V. A. Pleural Effusion,VI. Non-infectious Disorders of the Respiratory Tract,VI. C. Tumors of the Chest & Lungs,VII. Other Diseases with Prominent Respiratory Component,IX. Airways Disease,X. Others Diseases,ICD CODE,Diagnosis,Created By (User Id),Source Url,User Agent,User IP,Approval Status,Workflow Current Status Timestamp
4644,29/05/2021 7:46,chonghua.registry,Old,Male,07/08/2013,7,VI. Non-infectious Disorders of the Respiratory Tract,,,,,,A. Bronchial Asthma,,,,,J45.909,"Bronchial asthma, intermittent, in severe exacerbation",216,https://papp.org.ph/registry-of-diseases/registry-dashboard/,Mozilla/5.0 (Windows NT 10.0; Win64; x64; rv:88.0) Gecko/20100101 Firefox/88.0,180.232.130.138,3,
4643,29/05/2021 7:45,chonghua.registry,New,Female,12/02/2009,12,V. Pleural Diseases,,,,A. Pleural effusion,2. Non- Infectious,,,,,,J91.0,"Malignant pleural effusion, bilateral",216,https://papp.org.ph/registry-of-diseases/registry-dashboard/,Mozilla/5.0 (Windows NT 10.0; Win64; x64; rv:88.0) Gecko/20100101 Firefox/88.0,180.232.130.138,3,
4642,29/05/2021 7:44,chonghua.registry,New,Male,27/08/2005,15,IV. Infections of the Respiratory Tract,,B. Lower Respiratory Tract,"8 Pulmonary Tuberculosis (Exposure, Latent TB infection, TB Disease)",,,,,,,,A15.0,Pulmonary Tuberculosis bacteriologically-confirmed,216,https://papp.org.ph/registry-of-diseases/registry-dashboard/,Mozilla/5.0 (Windows NT 10.0; Win64; x64; rv:88.0) Gecko/20100101 Firefox/88.0,180.232.130.138,3,
4641,29/05/2021 7:42,chonghua.registry,New,Female,14/06/2020,0,IV. Infections of the Respiratory Tract,,B. Lower Respiratory Tract,3. Ventilator Associated Pneumonia,,,,,,,,J95.851,Ventilator-associated pneumonia,216,https://papp.org.ph/registry-of-diseases/registry-dashboard/,Mozilla/5.0 (Windows NT 10.0; Win64; x64; rv:88.0) Gecko/20100101 Firefox/88.0,180.232.130.138,3,
4640,29/05/2021 7:41,chonghua.registry,New,Female,23/03/2012,9,IV. Infections of the Respiratory Tract,,B. Lower Respiratory Tract,"1. Pneumonia, community acquired- (PCAP A, B, C or D)",,,,,,,,J18.9,Community-acquired pneumonia D,216,https://papp.org.ph/registry-of-diseases/registry-dashboard/,Mozilla/5.0 (Windows NT 10.0; Win64; x64; rv:88.0) Gecko/20100101 Firefox/88.0,180.232.130.138,3,
4639,29/05/2021 7:39,chonghua.registry,New,Male,03/02/2020,1,IV. Infections of the Respiratory Tract,,B. Lower Respiratory Tract,"1. Pneumonia, community acquired- (PCAP A, B, C or D)",,,,,,,,J21.9,Bronchiolitis,216,https://papp.org.ph/registry-of-diseases/registry-dashboard/,Mozilla/5.0 (Windows NT 10.0; Win64; x64; rv:88.0) Gecko/20100101 Firefox/88.0,180.232.130.138,3,
4638,29/05/2021 7:37,chonghua.registry,New,Male,31/05/2020,0,III. Bronchopulmonary Dysplasia,,,,,,,,,,,P27.1,"Bronchopulmonary dysplasia, moderate",216,https://papp.org.ph/registry-of-diseases/registry-dashboard/,Mozilla/5.0 (Windows NT 10.0; Win64; x64; rv:88.0) Gecko/20100101 Firefox/88.0,180.232.130.138,3,
4637,29/05/2021 7:36,chonghua.registry,New,Male,06/10/2020,0,II. Respiratory Disorders of the Newborn,,,,,,,,,,,P22.1,Transient tachypnea of the newborn,216,https://papp.org.ph/registry-of-diseases/registry-dashboard/,Mozilla/5.0 (Windows NT 10.0; Win64; x64; rv:88.0) Gecko/20100101 Firefox/88.0,180.232.130.138,3,
4636,29/05/2021 7:35,chonghua.registry,New,Female,14/10/2021,0,II. Respiratory Disorders of the Newborn,,,,,,,,,,,P23.9,Neonatal pneumonia,216,https://papp.org.ph/registry-of-diseases/registry-dashboard/,Mozilla/5.0 (Windows NT 10.0; Win64; x64; rv:88.0) Gecko/20100101 Firefox/88.0,180.232.130.138,3,
4635,29/05/2021 7:34,chonghua.registry,New,Male,06/10/2021,0,II. Respiratory Disorders of the Newborn,,,,,,,,,,,P23.9,Neonatal pneumonia,216,https://papp.org.ph/registry-of-diseases/registry-dashboard/,Mozilla/5.0 (Windows NT 10.0; Win64; x64; rv:88.0) Gecko/20100101 Firefox/88.0,180.232.130.138,3,
