﻿Entry ID,Date Created,Gender,Case Type,IV. B. Lower Respiratory Tract,IV. Infections of the Respiratory Tract,Date of Birth,Age,Disease Category,I. Congenital Malformations of the Respiratory Tract,IV. Infections of the Respiratory Tract,IV. B. Lower Respiratory Tract,V. Pleural Diseases,V. A. Pleural Effusion,VI. Non-infectious Disorders of the Respiratory Tract,VI. C. Tumors of the Chest & Lungs,VII. Other Diseases with Prominent Respiratory Component,IX. Airways Disease,XIII. Others Diseases,ICD - Diagnosis,Specific/Additional Pulmonary Diagnosis,Comorbidities & Others,Outcome,Submitted By
11960,7-Jul-22,Male,New,,,7/16/21,356,XIII. COVID-19,,,,,,,,,,,J12.82-PNEUMONIA DUE TO CORONAVIRUS DISEASE 2019 COVID-19,Chronic lung disease,CONGENITAL OBSTRUCTIVE HYDROCEPHALUS SECONDARY TO DANDY-WALKER MALFORMATION STATUS POST VENTRICULOPERITONEAL SHUNT INSERTION,Discharged,pgh.registry
11959,7-Jul-22,Male,New,,,7/21/11,4004,VII. Other Diseases with Prominent Respiratory Component,,,,,,,,A.Pumonary Congestion/Edema,,,J81.1-CHRONIC PULMONARY EDEMA,"Disseminated TB (pulmonary, pericardial), clinically diagnosed drug resistant","CONGESTIVE HEART FAILURE FROM PERICARDIAL EFFUSION, IN CONSTRICTIVE PHYSIOLOGY",Expired,pgh.registry
11958,7-Jul-22,Male,New,,,2/22/04,6710,XI. Ventilatory Support,,,,,,,,,,,Z99.1-DEPENDENCE ON RESPIRATOR,Upper airway obstruction from multiple injuries secondary to vehicular crash (motorcycle vs tricycle),"TRAUMATIC BRAIN INJURY, SEVERE",Discharged,pgh.registry
11957,7-Jul-22,Male,New,,,3/16/11,4131,V. Pleural Diseases,,,,B. Pneumothorax- including primary spontaneous and those with secondary causes,,,,,,,J95.811-POSTPROCEDURAL PNEUMOTHORAX=IATROGENIC PNEUMOTHORAX,,"SUBACUTE SPINAL CORD COMPRESSION FROM POTT&#039;S DISEASE STATUS POST C7, T2 POSTERIOR OSTEOTOMY, T1-T2 ANTERIOR CORPECTOMY, MANUBRIECTOMY, EXCISION OF TUMOR, CHEST TUBE THORACOSTOMY, RIGHT AND REMOVAL",Discharged,pgh.registry
11956,7-Jul-22,Female,New,,,7/20/16,2178,X. Preoperative Risk Assessment,,,,,,,,,,,"J18.9-PNEUMONIA, UNSPECIFIED ORGANISM=COMMUNITY ACQUIRED PNEUMONIA",,"CONGENITAL HEART DISEASE, CYANOTIC, TETRALOGY OF FALLOT",Discharged,pgh.registry
11955,7-Jul-22,Male,Old,,,10/16/14,2821,XII. Sleep Disordered Breathing,,,,,,,,,,,G47.33-OBSTRUCTIVE SLEEP APNEA,,"BILATERAL HYPERTROPHIC TONSILS GRADE II RIGHT, GRADE IV LEFT",Discharged,pgh.registry
11954,7-Jul-22,Male,New,,,12/3/16,2042,XII. Sleep Disordered Breathing,,,,,,,,,,,G47.33-OBSTRUCTIVE SLEEP APNEA,,"CHRONIC HYPERTROPHIC TONSILS, GRADE III LEFT, GRADE II RIGHT",Discharged,pgh.registry
11953,7-Jul-22,Male,New,"1. Pneumonia, community acquired- (PCAP A, B, C or D)",B. Lower Respiratory Tract,7/8/20,729,IV. Infections of the Respiratory Tract,,B. Lower Respiratory Tract,"1. Pneumonia, community acquired- (PCAP A, B, C or D)",,,,,,,,"J18.9-PNEUMONIA, UNSPECIFIED ORGANISM=RECURRENT PNEUMONIA",,"CONGESTIVE HEART FAILURE CLASS II-III MILD PULMONARY ARTERY HYPERTENSION STATUS POST VENTRICULAR SEPTAL DEFECT PATCH CLOSURE, RESECTION OF SUBAORTIC RIDGE (06/21/2022)",Discharged,pgh.registry
11952,7-Jul-22,Female,New,,,5/23/18,1506,VII. Other Diseases with Prominent Respiratory Component,,,,,,,,C. Interstitial Lung Diseases,,,J47.0-BRONCHIECTASIS WITH LOWER RESPIRATORY INFECTION,,"VACTERL ASSOCIATION (IMPERFORATE ANUS WITH RECTOVESTIBULAR FISTULA, ESOPHAGEAL ATRESIA WITH DISTAL TRACHEOESOPHAGEAL FISTULA, PATENT DUCTUS ARTERIOSUS WITH SPONTANEOUS CLOSURE)",Discharged,pgh.registry
11951,7-Jul-22,Male,New,2. Health Care Associated pneumonia,B. Lower Respiratory Tract,10/21/21,259,IV. Infections of the Respiratory Tract,,B. Lower Respiratory Tract,2. Health Care Associated pneumonia,,,,,,,,"J18.9-PNEUMONIA, UNSPECIFIED ORGANISM=NOSOCOMIAL PNEUMONIA",,"VACTERL ASSOCIATION (PATENT FORAMEN OVALE, IMPERFORATE ANUS, RECTOVESICAL FISTULA, CROSS FUSED RENAL ECTOPIA)",Discharged,pgh.registry
11950,7-Jul-22,Male,New,"1. Pneumonia, community acquired- (PCAP A, B, C or D)",B. Lower Respiratory Tract,3/1/18,1589,IV. Infections of the Respiratory Tract,,B. Lower Respiratory Tract,"1. Pneumonia, community acquired- (PCAP A, B, C or D)",,,,,,,,J69.0-ASPIRATION PNEUMONIA,,DISTAL ESOPHAGEAL ANASTOMOTIC STRICTURE SECONDARY TO ESOPHAGEAL ANASTOMOSIS FROM TRACHEOESOPHAGEAL FISTULA REPAIR,Discharged,pgh.registry
11949,7-Jul-22,Male,New,,,4/12/13,3373,VI. Non-infectious Disorders of the Respiratory Tract,,,,,,A. Bronchial Asthma,,,,,J45.0-BRONCHIAL ASTHMA=UNCONTROLLED,,,Discharged,pgh.registry
11948,7-Jul-22,Female,New,,,4/15/20,813,V. Pleural Diseases,,,,A. Pleural effusion,"1. Infectious-parapneumonic, effusion, TB effusion",,,,,,J86.9-PYOTHORAX WITHOUT FISTULA=EMPYEMA OF PLEURA,"Pulmonary tuberculosis, bacteriologically confirmed",,Discharged,pgh.registry
11947,7-Jul-22,Male,New,"8 Pulmonary Tuberculosis (Exposure, Latent TB infection, TB Disease)",B. Lower Respiratory Tract,8/30/05,6155,IV. Infections of the Respiratory Tract,,B. Lower Respiratory Tract,"8 Pulmonary Tuberculosis (Exposure, Latent TB infection, TB Disease)",,,,,,,,A15.0-PULMONARY TUBERCULOSIS,,,Discharged,pgh.registry
11946,7-Jul-22,Female,New,9. Extrapulmonary Tuberculosis,B. Lower Respiratory Tract,12/23/04,6405,IV. Infections of the Respiratory Tract,,B. Lower Respiratory Tract,9. Extrapulmonary Tuberculosis,,,,,,,,A19-DISSEMINATED TB,,"DECOMPENSATED LIVER DISEASE SECONDARY TO COMMON HEPATIC DUCT OBSTRUCTION, CHILD PUGH CLASS 3 PROBABLY TUBERCULOUS RULE OUT NEOPLASTIC (CHOLANGIOCARCINOMA)",Discharged,pgh.registry
11945,7-Jul-22,Female,New,"1. Pneumonia, community acquired- (PCAP A, B, C or D)",B. Lower Respiratory Tract,9/27/03,6858,IV. Infections of the Respiratory Tract,,B. Lower Respiratory Tract,"1. Pneumonia, community acquired- (PCAP A, B, C or D)",,,,,,,,"J18.9-PNEUMONIA, UNSPECIFIED ORGANISM=COMMUNITY ACQUIRED PNEUMONIA",,,Discharged,pgh.registry
11944,7-Jul-22,Male,New,,,10/17/05,6107,V. Pleural Diseases,,,,A. Pleural effusion,"1. Infectious-parapneumonic, effusion, TB effusion",,,,,,A15.6-TB EFFUSION,,,Discharged,pgh.registry
11943,7-Jul-22,Female,New,"1. Pneumonia, community acquired- (PCAP A, B, C or D)",B. Lower Respiratory Tract,4/19/11,4097,IV. Infections of the Respiratory Tract,,B. Lower Respiratory Tract,"1. Pneumonia, community acquired- (PCAP A, B, C or D)",,,,,,,,"J18.9-PNEUMONIA, UNSPECIFIED ORGANISM=COMMUNITY ACQUIRED PNEUMONIA",,,Discharged,pgh.registry
11942,7-Jul-22,Male,New,9. Extrapulmonary Tuberculosis,B. Lower Respiratory Tract,7/31/14,2898,IV. Infections of the Respiratory Tract,,B. Lower Respiratory Tract,9. Extrapulmonary Tuberculosis,,,,,,,,A19-DISSEMINATED TB,,,Discharged,pgh.registry
11941,7-Jul-22,Female,New,9. Extrapulmonary Tuberculosis,B. Lower Respiratory Tract,5/16/17,1878,IV. Infections of the Respiratory Tract,,B. Lower Respiratory Tract,9. Extrapulmonary Tuberculosis,,,,,,,,A19-DISSEMINATED TB,,,Discharged,pgh.registry
11940,7-Jul-22,Female,New,,,6/30/12,3659,V. Pleural Diseases,,,,A. Pleural effusion,"1. Infectious-parapneumonic, effusion, TB effusion",,,,,,A15.6-TB EFFUSION,,,Discharged,pgh.registry
11939,7-Jul-22,Male,New,"1. Pneumonia, community acquired- (PCAP A, B, C or D)",B. Lower Respiratory Tract,10/25/06,5734,IV. Infections of the Respiratory Tract,,B. Lower Respiratory Tract,"1. Pneumonia, community acquired- (PCAP A, B, C or D)",,,,,,,,"J18.9-PNEUMONIA, UNSPECIFIED ORGANISM=COMMUNITY ACQUIRED PNEUMONIA",,"HODGKIN LYMPHOMA, CLASSICAL, NODULAR SCLEROSIS, STAGE IV",Discharged,pgh.registry
11938,7-Jul-22,Female,New,,,6/18/09,4767,VI. Non-infectious Disorders of the Respiratory Tract,,,,,,A. Bronchial Asthma,,,,,"J45.41-BRONCHIAL ASTHMA, MODERATE PERSISTENT, IN ACUTE EXACERBATION",,,Discharged,pgh.registry
11937,7-Jul-22,Male,New,,,9/18/04,6501,XI. Ventilatory Support,,,,,,,,,,,Z99.1-DEPENDENCE ON RESPIRATOR,,BRAIN HERNIATION SECONDARY TO SEVERE TRAUMATIC BRAIN INJURY,Discharged,pgh.registry
11936,7-Jul-22,Male,New,,,7/4/18,1464,VI. Non-infectious Disorders of the Respiratory Tract,,,,,,A. Bronchial Asthma,,,,,"J45.41-BRONCHIAL ASTHMA, MODERATE PERSISTENT, IN ACUTE EXACERBATION",,,Discharged,pgh.registry
11935,7-Jul-22,Male,New,,,3/30/11,4117,V. Pleural Diseases,,,,A. Pleural effusion,"1. Infectious-parapneumonic, effusion, TB effusion",,,,,,A15.6-TB EFFUSION,"Disseminated tuberculosis (pulmonary, pleural, GI, cardiac, scrofula), clinically diagnosed, retreatment after  lost to follow up",,Discharged,pgh.registry
11934,7-Jul-22,Female,Old,"1. Pneumonia, community acquired- (PCAP A, B, C or D)",B. Lower Respiratory Tract,5/27/22,41,IV. Infections of the Respiratory Tract,,B. Lower Respiratory Tract,"1. Pneumonia, community acquired- (PCAP A, B, C or D)",,,,,,,,"J18.9-PNEUMONIA, UNSPECIFIED ORGANISM=COMMUNITY ACQUIRED PNEUMONIA",,"CONGENITAL HEART DISEASE, ACYANOTIC, COMPLETE ATRIOVENTRICULAR SEPTAL DEFECT, IN FAILURE",Discharged,pgh.registry
11933,7-Jul-22,Female,Old,,,7/7/22,0,I. Congenital Malformations of the Respiratory Tract,C. Diaphragm Deformities,,,,,,,,,,Q79.0-CONGENITAL DIAPHRAGMATIC HERNIA=BOCHDALECH,"Pulmonary hypertension, mild",,Discharged,pgh.registry
11932,7-Jul-22,Male,Old,,,4/1/22,97,IX. Airways Disease,,,,,,,,,C. Acquired diseases e.g. Bronchial stenosis due to prolonged Intubation,,J38.4-LARYNGEAL EDEMA,Nosocomial pneumonia,CLINICAL DOWN SYNDROME,Discharged,pgh.registry
11931,7-Jul-22,Male,Old,9. Extrapulmonary Tuberculosis,B. Lower Respiratory Tract,6/13/09,4772,IV. Infections of the Respiratory Tract,,B. Lower Respiratory Tract,9. Extrapulmonary Tuberculosis,,,,,,,,A19-DISSEMINATED TB,,,Discharged,pgh.registry
11930,7-Jul-22,Female,Old,,,10/10/08,5018,V. Pleural Diseases,,,,A. Pleural effusion,"1. Infectious-parapneumonic, effusion, TB effusion",,,,,,A15.6-TB EFFUSION,,,Discharged,pgh.registry
11929,7-Jul-22,Male,Old,,,2/15/19,1238,V. Pleural Diseases,,,,A. Pleural effusion,2. Non- Infectious,,,,,,J91.0-PLEURAL EFFUSION NON INFECTIOUS (MALIGNANT),,,Expired,pgh.registry
11928,7-Jul-22,Female,Old,"8 Pulmonary Tuberculosis (Exposure, Latent TB infection, TB Disease)",B. Lower Respiratory Tract,7/1/20,736,IV. Infections of the Respiratory Tract,,B. Lower Respiratory Tract,"8 Pulmonary Tuberculosis (Exposure, Latent TB infection, TB Disease)",,,,,,,,A15.0-PULMONARY TUBERCULOSIS,,,Discharged,pgh.registry
11927,7-Jul-22,Male,Old,,,7/18/04,6563,V. Pleural Diseases,,,,B. Pneumothorax- including primary spontaneous and those with secondary causes,,,,,,,J93.12-SECONDARY SPONTANEOUS PNEUMOTHORAX,"Pulmonary tuberculosis, bacteriologically confirmed",,Discharged,pgh.registry
11926,7-Jul-22,Female,Old,9. Extrapulmonary Tuberculosis,B. Lower Respiratory Tract,6/9/13,3315,IV. Infections of the Respiratory Tract,,B. Lower Respiratory Tract,9. Extrapulmonary Tuberculosis,,,,,,,,A19-DISSEMINATED TB,,,Discharged,pgh.registry
11925,7-Jul-22,Male,Old,,,8/15/08,5074,V. Pleural Diseases,,,,A. Pleural effusion,"1. Infectious-parapneumonic, effusion, TB effusion",,,,,,J86.0PYOTHORAX WITH FISTULA=EMPYEMA WITH BRONCHOCUTANEOUS/BRONCHOPLEURAL FISTULA,"Mixed germ cell tumor (mature teratoma, yolk sac tumor), left mediastinum",,Discharged,pgh.registry
,,,,,,,,,,,,,,,,,,,,,,,
,,,,,,,,,,,,,,,,,,,,,,,
,,,,,,,,,,,,,,,,,,,,,,,
,,,,,,,,,,,,,,,,,,,,,,,
,,,,,,,,,,,,,,,,,,,,,,,
,,,,,,,,,,,,,,,,,,,,,,,
,,,,,,,,,,,,,,,,,,,,,,,
,,,,,,,,,,,,,,,,,,,,,,,
,,,,,,,,,,,,,,,,,,,,,,,
,,,,,,,,,,,,,,,,,,,,,,,
,,,,,,,,,,,,,,,,,,,,,,,
,,,,,,,,,,,,,,,,,,,,,,,
,,,,,,,,,,,,,,,,,,,,,,,
,,,,,,,,,,,,,,,,,,,,,,,
,,,,,,,,,,,,,,,,,,,,,,,
,,,,,,,,,,,,,,,,,,,,,,,
,,,,,,,,,,,,,,,,,,,,,,,
,,,,,,,,,,,,,,,,,,,,,,,
,,,,,,,,,,,,,,,,,,,,,,,
,,,,,,,,,,,,,,,,,,,,,,,
,,,,,,,,,,,,,,,,,,,,,,,
,,,,,,,,,,,,,,,,,,,,,,,
,,,,,,,,,,,,,,,,,,,,,,,
,,,,,,,,,,,,,,,,,,,,,,,
,,,,,,,,,,,,,,,,,,,,,,,
,,,,,,,,,,,,,,,,,,,,,,,
,,,,,,,,,,,,,,,,,,,,,,,
,,,,,,,,,,,,,,,,,,,,,,,
,,,,,,,,,,,,,,,,,,,,,,,
,,,,,,,,,,,,,,,,,,,,,,,
,,,,,,,,,,,,,,,,,,,,,,,
,,,,,,,,,,,,,,,,,,,,,,,
,,,,,,,,,,,,,,,,,,,,,,,
,,,,,,,,,,,,,,,,,,,,,,,
,,,,,,,,,,,,,,,,,,,,,,,
,,,,,,,,,,,,,,,,,,,,,,,
,,,,,,,,,,,,,,,,,,,,,,,
,,,,,,,,,,,,,,,,,,,,,,,
,,,,,,,,,,,,,,,,,,,,,,,
,,,,,,,,,,,,,,,,,,,,,,,
,,,,,,,,,,,,,,,,,,,,,,,
,,,,,,,,,,,,,,,,,,,,,,,
,,,,,,,,,,,,,,,,,,,,,,,
,,,,,,,,,,,,,,,,,,,,,,,
,,,,,,,,,,,,,,,,,,,,,,,
,,,,,,,,,,,,,,,,,,,,,,,
,,,,,,,,,,,,,,,,,,,,,,,
,,,,,,,,,,,,,,,,,,,,,,,
,,,,,,,,,,,,,,,,,,,,,,,
,,,,,,,,,,,,,,,,,,,,,,,
,,,,,,,,,,,,,,,,,,,,,,,
,,,,,,,,,,,,,,,,,,,,,,,
,,,,,,,,,,,,,,,,,,,,,,,
,,,,,,,,,,,,,,,,,,,,,,,
,,,,,,,,,,,,,,,,,,,,,,,
,,,,,,,,,,,,,,,,,,,,,,,
,,,,,,,,,,,,,,,,,,,,,,,
,,,,,,,,,,,,,,,,,,,,,,,
,,,,,,,,,,,,,,,,,,,,,,,
,,,,,,,,,,,,,,,,,,,,,,,
,,,,,,,,,,,,,,,,,,,,,,,
,,,,,,,,,,,,,,,,,,,,,,,
,,,,,,,,,,,,,,,,,,,,,,,
,,,,,,,,,,,,,,,,,,,,,,,